{"text_format":"2","workbook":"xlsx","n_sheets":3,"sheets":["Instructions","Method Comparison","Alt Method Comparison"],"not_rendered":{"charts":5,"images":0,"macros":0,"external_links":0,"defined_names":3,"comments":0,"pivot_tables":0},"unopened":[],"bounds":{"document_bytes":16777216,"sheet_cells":100000,"run_cost":"one","rows_first":2000,"rows_last":500,"rows_between":2000,"halvings":0,"cell_chars":16384,"cell_head_chars":4096},"cells_cut":0,"cells_raw":0,"read":"whole","date_system":"1900"}

{"sheet":"Instructions","index":0,"n_rows":34,"n_cols":1,"rows_kept":34,"cut":false,"hidden":false,"merged":[]}
["NOTICE: This document is an example only. It must be revised to reflect your lab’s specific processes and/or specific protocol requirements."]
["Approved and current. Effective starting 12-Jun-2023. Last reviewed on 09-Jun-2023.\r\nVAL 2002 (version 1.1). Quantitative Accuracy Pack. Page 1 of 3"]
["Instructions:"]
[]
["Method Comparison:    "]
["1.   Plot the reference method on the X axis and the method being validated on the Y axis."]
["2.   Enter the Allowable Total Error (TEa) concentration and percent.  Refer to pSMILE Chemistry (EQA 1380a), Coagulation (EQA 1380b) or Hematology (EQA 1380c) TE Limits table. "]
["3.   Enter the results for the reference (X) and the new (Y) methods."]
["4.   Evaluate the statistics."]
["5.  If R value is <0.975, Data does not extend over acceptable range. More data must be evaluated over larger range."]
["6.   The correlation coefficient (R) must be >0.975. "]
["a.  95% of the data points from the comparative method must be within Total Allowable Error limits of the reference method. This can be evaluated by calculating the \"Error Index\" "]
["Alternate Method Comparison:"]
["Use if the standard method comparison has less than ideal results.  This method takes into account the Medical Decision Points and evaluates using the calculations and criteria below."]
["Error Index:  to measure the difference between the two methods as a ratio of the Total Allowable Error. "]
["1.  Using the Method Comparison spreadsheet tab the Error Index can be calculated by subtracting the reference method data point (X) from the method being validated data point (Y) and dividing by the Total Allowable Error (TEa). The equation is: (Y-X)/TEa. "]
["2.  Use the percent TEa or the minimum detectable difference (absolute TEa), whichever is greater."]
["3.  The absolute TEa value is calculated by converting the TEa percentage to a decimal and multiplying by the reference method data point. "]
["4. The Error Index is measured for each X-Y pair, and must fall within -1 and 1. If more than 5% of the specimens have an Error Index of less than -1 or greater than 1, the accuracy experiment fails"]
["5.  If 95% of Error Indices are acceptable, Accuracy is acceptable. Proceed with Linearity experiments"]
["6.  If < 95% Error Indices are acceptable, plot the data from the Method Comparison Tab. Deming Regression is preferred, however if not available regular regression is acceptable provided that the Correlation Coefficient (R) is >0.975."]
["a.  Plot the reference method on the X axis and the method being validated on the Y axis."]
["b.  Enter the Allowable Total Error (TEa) concentration and percent.  Refer to SMILE Chemistry, Coagulation or Hematology TE Limits table (EQA 1380a, EQA 1380b or EQA 1380c)."]
["c.  Enter Medical Decision Points (MDP)"]
["                   i.  A Medical Decision Point is the concentration of the analyte at which a medical decision is triggered. You may enter up to five values. These values are plotted on the graph, and the program computes a predicted Y value and confidence interval at each X decision point. "]
["                  ii.  For many analytes, the medical decision points correspond to the lower and upper limits of the normal range. It is advisable to also include medical decision points at the DAIDS Toxicity limits and/or laboratory established critical values."]
["95% Confidence limits and Error Indices: "]
["1. Subtract the X Method MDP from the low and the high 95% confidence limits for each Medical Decision Point."]
["2. Calculate Error Indices for each end of the 95% confidence limits for each Medical Decision Point as follows:  Divide the difference (from step i. above) by the SMILE TE Limit absolute value."]
["     a. Use the percent TEa or the minimum detectable difference, whichever is greater. "]
["     b. To calculate the absolute TEa value, convert the TEa percentage to a decimal and multiply by the reference method data point. "]
["                  i.       All error indices must fall within -1 and 1. Use the Error Index Calculation tab spreadsheet to calculate Error Indices."]
["3. All error indices fall between -1 and 1, accuracy is acceptable "]
["4. Any error indices fall outside -1 and 1, consider possible causes of inaccuracy. Troubleshoot before repeating accuracy studies. "]

{"sheet":"Method Comparison","index":1,"n_rows":37,"n_cols":11,"rows_kept":37,"cut":false,"hidden":false,"merged":[[2,1,2,11],[4,1,4,3],[5,1,5,3],[9,0,9,4],[37,0,37,1],[32,5,33,13],[34,0,34,1],[35,0,35,1],[36,0,36,1]]}
["NOTICE: This document is an example only. It must be revised to reflect your lab’s specific processes and/or specific protocol requirements."]
["Approved and current. Effective starting 12-Jun-2023. Last reviewed on 09-Jun-2023.\r\nVAL 2002 (version 1.1). Quantitative Accuracy Pack. Page 2 of 3"]
[null," Quantitative Method Comparison"]
[]
[null,"Method being evaluated (Y):",{"$nulls":7},"Date:"]
[null,"Reference Method (X): ",{"$nulls":7},"Total Allowable Error (TEa):"]
[null,null,null,"Analyte:",{"$nulls":5},"Conc.","Pct."]
[null,null,null,"Units:"]
[]
[{"$f":"IF(AND($C$37>0.975,$H$32>=19),\"Experiment: PASSED\",\"Experiment: FAILED (See Note Below**)\")","v":{"$error":"#DIV/0!"}}]
["Spec#","X","Y","Δ","Error Index","High lmt","Low lmt","Grade"]
[1,null,null,{"$f":"C12-B12","v":0},{"$f":"IF($J$8>B12*($K$8/100),D12/$J$8,D12/(B12*($K$8/100)))","v":{"$error":"#DIV/0!"}},{"$f":"IF(B12+$J$8>B12*((100+$K$8)/100),B12+$J$8,B12*((100+$K$8)/100))","v":0},{"$f":"IF(B12-$J$8<B12*((100-$K$8)/100),B12-$J$8,B12*((100-$K$8)/100))","v":0},{"$f":"IF(AND(E12>=-1,E12<=1),1,0)","v":{"$error":"#DIV/0!"}}]
[{"$f":"A12+1","v":2},null,null,{"$f":"C13-B13","v":0},{"$f":"IF($J$8>B13*($K$8/100),D13/$J$8,D13/(B13*($K$8/100)))","v":{"$error":"#DIV/0!"}},{"$f":"IF(B13+$J$8>B13*((100+$K$8)/100),B13+$J$8,B13*((100+$K$8)/100))","v":0},{"$f":"IF(B13-$J$8<B13*((100-$K$8)/100),B13-$J$8,B13*((100-$K$8)/100))","v":0},{"$f":"IF(AND(E13>=-1,E13<=1),1,0)","v":{"$error":"#DIV/0!"}}]
[{"$f":"A13+1","v":3},null,null,{"$f":"C14-B14","v":0},{"$f":"IF($J$8>B14*($K$8/100),D14/$J$8,D14/(B14*($K$8/100)))","v":{"$error":"#DIV/0!"}},{"$f":"IF(B14+$J$8>B14*((100+$K$8)/100),B14+$J$8,B14*((100+$K$8)/100))","v":0},{"$f":"IF(B14-$J$8<B14*((100-$K$8)/100),B14-$J$8,B14*((100-$K$8)/100))","v":0},{"$f":"IF(AND(E14>=-1,E14<=1),1,0)","v":{"$error":"#DIV/0!"}}]
[{"$f":"A14+1","v":4},null,null,{"$f":"C15-B15","v":0},{"$f":"IF($J$8>B15*($K$8/100),D15/$J$8,D15/(B15*($K$8/100)))","v":{"$error":"#DIV/0!"}},{"$f":"IF(B15+$J$8>B15*((100+$K$8)/100),B15+$J$8,B15*((100+$K$8)/100))","v":0},{"$f":"IF(B15-$J$8<B15*((100-$K$8)/100),B15-$J$8,B15*((100-$K$8)/100))","v":0},{"$f":"IF(AND(E15>=-1,E15<=1),1,0)","v":{"$error":"#DIV/0!"}}]
[{"$f":"A15+1","v":5},null,null,{"$f":"C16-B16","v":0},{"$f":"IF($J$8>B16*($K$8/100),D16/$J$8,D16/(B16*($K$8/100)))","v":{"$error":"#DIV/0!"}},{"$f":"IF(B16+$J$8>B16*((100+$K$8)/100),B16+$J$8,B16*((100+$K$8)/100))","v":0},{"$f":"IF(B16-$J$8<B16*((100-$K$8)/100),B16-$J$8,B16*((100-$K$8)/100))","v":0},{"$f":"IF(AND(E16>=-1,E16<=1),1,0)","v":{"$error":"#DIV/0!"}}]
[{"$f":"A16+1","v":6},null,null,{"$f":"C17-B17","v":0},{"$f":"IF($J$8>B17*($K$8/100),D17/$J$8,D17/(B17*($K$8/100)))","v":{"$error":"#DIV/0!"}},{"$f":"IF(B17+$J$8>B17*((100+$K$8)/100),B17+$J$8,B17*((100+$K$8)/100))","v":0},{"$f":"IF(B17-$J$8<B17*((100-$K$8)/100),B17-$J$8,B17*((100-$K$8)/100))","v":0},{"$f":"IF(AND(E17>=-1,E17<=1),1,0)","v":{"$error":"#DIV/0!"}}]
[{"$f":"A17+1","v":7},null,null,{"$f":"C18-B18","v":0},{"$f":"IF($J$8>B18*($K$8/100),D18/$J$8,D18/(B18*($K$8/100)))","v":{"$error":"#DIV/0!"}},{"$f":"IF(B18+$J$8>B18*((100+$K$8)/100),B18+$J$8,B18*((100+$K$8)/100))","v":0},{"$f":"IF(B18-$J$8<B18*((100-$K$8)/100),B18-$J$8,B18*((100-$K$8)/100))","v":0},{"$f":"IF(AND(E18>=-1,E18<=1),1,0)","v":{"$error":"#DIV/0!"}}]
[{"$f":"A18+1","v":8},null,null,{"$f":"C19-B19","v":0},{"$f":"IF($J$8>B19*($K$8/100),D19/$J$8,D19/(B19*($K$8/100)))","v":{"$error":"#DIV/0!"}},{"$f":"IF(B19+$J$8>B19*((100+$K$8)/100),B19+$J$8,B19*((100+$K$8)/100))","v":0},{"$f":"IF(B19-$J$8<B19*((100-$K$8)/100),B19-$J$8,B19*((100-$K$8)/100))","v":0},{"$f":"IF(AND(E19>=-1,E19<=1),1,0)","v":{"$error":"#DIV/0!"}}]
[{"$f":"A19+1","v":9},null,null,{"$f":"C20-B20","v":0},{"$f":"IF($J$8>B20*($K$8/100),D20/$J$8,D20/(B20*($K$8/100)))","v":{"$error":"#DIV/0!"}},{"$f":"IF(B20+$J$8>B20*((100+$K$8)/100),B20+$J$8,B20*((100+$K$8)/100))","v":0},{"$f":"IF(B20-$J$8<B20*((100-$K$8)/100),B20-$J$8,B20*((100-$K$8)/100))","v":0},{"$f":"IF(AND(E20>=-1,E20<=1),1,0)","v":{"$error":"#DIV/0!"}}]
[{"$f":"A20+1","v":10},null,null,{"$f":"C21-B21","v":0},{"$f":"IF($J$8>B21*($K$8/100),D21/$J$8,D21/(B21*($K$8/100)))","v":{"$error":"#DIV/0!"}},{"$f":"IF(B21+$J$8>B21*((100+$K$8)/100),B21+$J$8,B21*((100+$K$8)/100))","v":0},{"$f":"IF(B21-$J$8<B21*((100-$K$8)/100),B21-$J$8,B21*((100-$K$8)/100))","v":0},{"$f":"IF(AND(E21>=-1,E21<=1),1,0)","v":{"$error":"#DIV/0!"}}]
[{"$f":"A21+1","v":11},null,null,{"$f":"C22-B22","v":0},{"$f":"IF($J$8>B22*($K$8/100),D22/$J$8,D22/(B22*($K$8/100)))","v":{"$error":"#DIV/0!"}},{"$f":"IF(B22+$J$8>B22*((100+$K$8)/100),B22+$J$8,B22*((100+$K$8)/100))","v":0},{"$f":"IF(B22-$J$8<B22*((100-$K$8)/100),B22-$J$8,B22*((100-$K$8)/100))","v":0},{"$f":"IF(AND(E22>=-1,E22<=1),1,0)","v":{"$error":"#DIV/0!"}}]
[{"$f":"A22+1","v":12},null,null,{"$f":"C23-B23","v":0},{"$f":"IF($J$8>B23*($K$8/100),D23/$J$8,D23/(B23*($K$8/100)))","v":{"$error":"#DIV/0!"}},{"$f":"IF(B23+$J$8>B23*((100+$K$8)/100),B23+$J$8,B23*((100+$K$8)/100))","v":0},{"$f":"IF(B23-$J$8<B23*((100-$K$8)/100),B23-$J$8,B23*((100-$K$8)/100))","v":0},{"$f":"IF(AND(E23>=-1,E23<=1),1,0)","v":{"$error":"#DIV/0!"}}]
[{"$f":"A23+1","v":13},null,null,{"$f":"C24-B24","v":0},{"$f":"IF($J$8>B24*($K$8/100),D24/$J$8,D24/(B24*($K$8/100)))","v":{"$error":"#DIV/0!"}},{"$f":"IF(B24+$J$8>B24*((100+$K$8)/100),B24+$J$8,B24*((100+$K$8)/100))","v":0},{"$f":"IF(B24-$J$8<B24*((100-$K$8)/100),B24-$J$8,B24*((100-$K$8)/100))","v":0},{"$f":"IF(AND(E24>=-1,E24<=1),1,0)","v":{"$error":"#DIV/0!"}}]
[{"$f":"A24+1","v":14},null,null,{"$f":"C25-B25","v":0},{"$f":"IF($J$8>B25*($K$8/100),D25/$J$8,D25/(B25*($K$8/100)))","v":{"$error":"#DIV/0!"}},{"$f":"IF(B25+$J$8>B25*((100+$K$8)/100),B25+$J$8,B25*((100+$K$8)/100))","v":0},{"$f":"IF(B25-$J$8<B25*((100-$K$8)/100),B25-$J$8,B25*((100-$K$8)/100))","v":0},{"$f":"IF(AND(E25>=-1,E25<=1),1,0)","v":{"$error":"#DIV/0!"}}]
[{"$f":"A25+1","v":15},null,null,{"$f":"C26-B26","v":0},{"$f":"IF($J$8>B26*($K$8/100),D26/$J$8,D26/(B26*($K$8/100)))","v":{"$error":"#DIV/0!"}},{"$f":"IF(B26+$J$8>B26*((100+$K$8)/100),B26+$J$8,B26*((100+$K$8)/100))","v":0},{"$f":"IF(B26-$J$8<B26*((100-$K$8)/100),B26-$J$8,B26*((100-$K$8)/100))","v":0},{"$f":"IF(AND(E26>=-1,E26<=1),1,0)","v":{"$error":"#DIV/0!"}}]
[{"$f":"A26+1","v":16},null,null,{"$f":"C27-B27","v":0},{"$f":"IF($J$8>B27*($K$8/100),D27/$J$8,D27/(B27*($K$8/100)))","v":{"$error":"#DIV/0!"}},{"$f":"IF(B27+$J$8>B27*((100+$K$8)/100),B27+$J$8,B27*((100+$K$8)/100))","v":0},{"$f":"IF(B27-$J$8<B27*((100-$K$8)/100),B27-$J$8,B27*((100-$K$8)/100))","v":0},{"$f":"IF(AND(E27>=-1,E27<=1),1,0)","v":{"$error":"#DIV/0!"}}]
[{"$f":"A27+1","v":17},null,null,{"$f":"C28-B28","v":0},{"$f":"IF($J$8>B28*($K$8/100),D28/$J$8,D28/(B28*($K$8/100)))","v":{"$error":"#DIV/0!"}},{"$f":"IF(B28+$J$8>B28*((100+$K$8)/100),B28+$J$8,B28*((100+$K$8)/100))","v":0},{"$f":"IF(B28-$J$8<B28*((100-$K$8)/100),B28-$J$8,B28*((100-$K$8)/100))","v":0},{"$f":"IF(AND(E28>=-1,E28<=1),1,0)","v":{"$error":"#DIV/0!"}}]
[{"$f":"A28+1","v":18},null,null,{"$f":"C29-B29","v":0},{"$f":"IF($J$8>B29*($K$8/100),D29/$J$8,D29/(B29*($K$8/100)))","v":{"$error":"#DIV/0!"}},{"$f":"IF(B29+$J$8>B29*((100+$K$8)/100),B29+$J$8,B29*((100+$K$8)/100))","v":0},{"$f":"IF(B29-$J$8<B29*((100-$K$8)/100),B29-$J$8,B29*((100-$K$8)/100))","v":0},{"$f":"IF(AND(E29>=-1,E29<=1),1,0)","v":{"$error":"#DIV/0!"}}]
[{"$f":"A29+1","v":19},null,null,{"$f":"C30-B30","v":0},{"$f":"IF($J$8>B30*($K$8/100),D30/$J$8,D30/(B30*($K$8/100)))","v":{"$error":"#DIV/0!"}},{"$f":"IF(B30+$J$8>B30*((100+$K$8)/100),B30+$J$8,B30*((100+$K$8)/100))","v":0},{"$f":"IF(B30-$J$8<B30*((100-$K$8)/100),B30-$J$8,B30*((100-$K$8)/100))","v":0},{"$f":"IF(AND(E30>=-1,E30<=1),1,0)","v":{"$error":"#DIV/0!"}}]
[{"$f":"A30+1","v":20},null,null,{"$f":"C31-B31","v":0},{"$f":"IF($J$8>B31*($K$8/100),D31/$J$8,D31/(B31*($K$8/100)))","v":{"$error":"#DIV/0!"}},{"$f":"IF(B31+$J$8>B31*((100+$K$8)/100),B31+$J$8,B31*((100+$K$8)/100))","v":0},{"$f":"IF(B31-$J$8<B31*((100-$K$8)/100),B31-$J$8,B31*((100-$K$8)/100))","v":0},{"$f":"IF(AND(E31>=-1,E31<=1),1,0)","v":{"$error":"#DIV/0!"}}]
["Mean",{"$f":"AVERAGE(B12:B31)","v":{"$error":"#DIV/0!"}},{"$f":"AVERAGE(C12:C31)","v":{"$error":"#DIV/0!"}},{"$f":"AVERAGE(D12:D31)","v":0},{"$f":"AVERAGE(E12:E31)","v":{"$error":"#DIV/0!"}},null,null,{"$f":"SUM(H12:H31)","v":{"$error":"#DIV/0!"}}]
["Min",{"$f":"MIN(B12:B31)","v":0},{"$f":"MIN(C12:C31)","v":0},{"$f":"MIN(D12:D31)","v":0},{"$f":"MIN(E12:E31)","v":{"$error":"#DIV/0!"}},{"$f":"IF($H$32<19,\"**Greater than 5% of the error indices are unacceptable. IF the correlation coeficient is greater than 0.975 (see below-left), see Alt Method Comparison tab for evaluation.\",\"\")","v":{"$error":"#DIV/0!"}}]
["Max",{"$f":"MAX(B12:B31)","v":0},{"$f":"MAX(C12:C31)","v":0},{"$f":"MAX(D12:D31)","v":0},{"$f":"MAX(E12:E31)","v":{"$error":"#DIV/0!"}}]
["Slope",null,{"$f":"SLOPE(C12:C31,B12:B31)","v":{"$error":"#DIV/0!"}}]
["Intercept",null,{"$f":"INTERCEPT(C12:C31,B12:B31)","v":{"$error":"#DIV/0!"}}]
["Correl. Coef. (R)",null,{"$f":"CORREL(B12:B31,C12:C31)","v":{"$error":"#DIV/0!"}},{"$f":"IF(C37<0.975,\"**Correlation Coefficient is too low. Troubleshoot Assay and re-analyse specimens\",\"\")","v":{"$error":"#DIV/0!"}}]

{"sheet":"Alt Method Comparison","index":2,"n_rows":59,"n_cols":18,"rows_kept":59,"cut":false,"hidden":false,"merged":[[2,6,3,14],[25,12,25,14],[40,7,40,8],[41,7,41,8],[42,7,42,8],[5,15,5,16],[44,7,44,8],[43,7,43,8],[35,8,35,11],[5,6,5,8],[6,7,6,8],[7,9,7,13],[6,9,6,13],[5,9,5,13]]}
["NOTICE: This document is an example only. It must be revised to reflect your lab’s specific processes and/or specific protocol requirements."]
["Approved and current. Effective starting 12-Jun-2023. Last reviewed on 09-Jun-2023.\r\nVAL 2002 (version 1.1). Quantitative Accuracy Pack. Page 3 of 3"]
[{"$nulls":6},"Alternate (Quantitative) Method Comparison",{"$nulls":10},{"$f":"(D12/B12)*100","v":{"$error":"#DIV/0!"}}]
[{"$nulls":17},{"$f":"(D13/B13)*100","v":{"$error":"#DIV/0!"}}]
[{"$nulls":17},{"$f":"(D14/B14)*100","v":{"$error":"#DIV/0!"}}]
[{"$nulls":6},"Method being evaluated:",null,null,{"$f":"'Method Comparison'!E5","v":0},{"$nulls":4},"Date:",{"$f":"'Method Comparison'!K5","v":0},null,{"$f":"(D15/B15)*100","v":{"$error":"#DIV/0!"}}]
[{"$nulls":7},"Reference Method: ",null,{"$f":"'Method Comparison'!E6","v":0},{"$nulls":4},"Total Allowable Error (TEa):",null,null,{"$f":"(D16/B16)*100","v":{"$error":"#DIV/0!"}}]
[{"$nulls":8},"Analyte:",{"$f":"'Method Comparison'!E7","v":0},{"$nulls":4},"Conc.","Pct.",null,{"$f":"(D17/B17)*100","v":{"$error":"#DIV/0!"}}]
[{"$nulls":8},"Units:",{"$f":"IF('Method Comparison'!E8>0,'Method Comparison'!E8,\"Units not entered\")","v":"Units not entered"},{"$nulls":4},{"$f":"'Method Comparison'!J8","v":0},{"$f":"'Method Comparison'!K8","v":0},null,{"$f":"(D18/B18)*100","v":{"$error":"#DIV/0!"}}]
[{"$nulls":17},{"$f":"(D19/B19)*100","v":{"$error":"#DIV/0!"}}]
["Spec#","X","Y","∆","((Y-X)-Bias)^2",{"$nulls":12},{"$f":"(D20/B20)*100","v":{"$error":"#DIV/0!"}}]
[1,{"$f":"'Method Comparison'!B12","v":0},{"$f":"'Method Comparison'!C12","v":0},{"$f":"C12-B12","v":0},{"$f":"POWER(D12-$D$35,2)","v":0},{"$f":"E12/19","v":0},{"$nulls":11},{"$f":"(D21/B21)*100","v":{"$error":"#DIV/0!"}}]
[{"$f":"A12+1","v":2},{"$f":"'Method Comparison'!B13","v":0},{"$f":"'Method Comparison'!C13","v":0},{"$f":"C13-B13","v":0},{"$f":"POWER(D13-$D$35,2)","v":0},{"$f":"E13/19","v":0},{"$nulls":11},{"$f":"(D22/B22)*100","v":{"$error":"#DIV/0!"}}]
[{"$f":"A13+1","v":3},{"$f":"'Method Comparison'!B14","v":0},{"$f":"'Method Comparison'!C14","v":0},{"$f":"C14-B14","v":0},{"$f":"POWER(D14-$D$35,2)","v":0},{"$f":"E14/19","v":0},{"$nulls":11},{"$f":"(D23/B23)*100","v":{"$error":"#DIV/0!"}}]
[{"$f":"A14+1","v":4},{"$f":"'Method Comparison'!B15","v":0},{"$f":"'Method Comparison'!C15","v":0},{"$f":"C15-B15","v":0},{"$f":"POWER(D15-$D$35,2)","v":0},{"$f":"E15/19","v":0},{"$nulls":11},{"$f":"(D24/B24)*100","v":{"$error":"#DIV/0!"}}]
[{"$f":"A15+1","v":5},{"$f":"'Method Comparison'!B16","v":0},{"$f":"'Method Comparison'!C16","v":0},{"$f":"C16-B16","v":0},{"$f":"POWER(D16-$D$35,2)","v":0},{"$f":"E16/19","v":0},null,0,{"$f":"J38","v":{"$error":"#DIV/0!"}},{"$nulls":8},{"$f":"(D25/B25)*100","v":{"$error":"#DIV/0!"}}]
[{"$f":"A16+1","v":6},{"$f":"'Method Comparison'!B17","v":0},{"$f":"'Method Comparison'!C17","v":0},{"$f":"C17-B17","v":0},{"$f":"POWER(D17-$D$35,2)","v":0},{"$f":"E17/19","v":0},null,{"$f":"B12","v":0},{"$f":"C12","v":0},{"$nulls":8},{"$f":"(D26/B26)*100","v":{"$error":"#DIV/0!"}}]
[{"$f":"A17+1","v":7},{"$f":"'Method Comparison'!B18","v":0},{"$f":"'Method Comparison'!C18","v":0},{"$f":"C18-B18","v":0},{"$f":"POWER(D18-$D$35,2)","v":0},{"$f":"E18/19","v":0},{"$nulls":11},{"$f":"(D27/B27)*100","v":{"$error":"#DIV/0!"}}]
[{"$f":"A18+1","v":8},{"$f":"'Method Comparison'!B19","v":0},{"$f":"'Method Comparison'!C19","v":0},{"$f":"C19-B19","v":0},{"$f":"POWER(D19-$D$35,2)","v":0},{"$f":"E19/19","v":0},{"$nulls":11},{"$f":"(D28/B28)*100","v":{"$error":"#DIV/0!"}}]
[{"$f":"A19+1","v":9},{"$f":"'Method Comparison'!B20","v":0},{"$f":"'Method Comparison'!C20","v":0},{"$f":"C20-B20","v":0},{"$f":"POWER(D20-$D$35,2)","v":0},{"$f":"E20/19","v":0},{"$nulls":11},{"$f":"(D29/B29)*100","v":{"$error":"#DIV/0!"}}]
[{"$f":"A20+1","v":10},{"$f":"'Method Comparison'!B21","v":0},{"$f":"'Method Comparison'!C21","v":0},{"$f":"C21-B21","v":0},{"$f":"POWER(D21-$D$35,2)","v":0},{"$f":"E21/19","v":0},{"$nulls":11},{"$f":"(D30/B30)*100","v":{"$error":"#DIV/0!"}}]
[{"$f":"A21+1","v":11},{"$f":"'Method Comparison'!B22","v":0},{"$f":"'Method Comparison'!C22","v":0},{"$f":"C22-B22","v":0},{"$f":"POWER(D22-$D$35,2)","v":0},{"$f":"E22/19","v":0},{"$nulls":11},{"$f":"(D31/B31)*100","v":{"$error":"#DIV/0!"}}]
[{"$f":"A22+1","v":12},{"$f":"'Method Comparison'!B23","v":0},{"$f":"'Method Comparison'!C23","v":0},{"$f":"C23-B23","v":0},{"$f":"POWER(D23-$D$35,2)","v":0},{"$f":"E23/19","v":0}]
[{"$f":"A23+1","v":13},{"$f":"'Method Comparison'!B24","v":0},{"$f":"'Method Comparison'!C24","v":0},{"$f":"C24-B24","v":0},{"$f":"POWER(D24-$D$35,2)","v":0},{"$f":"E24/19","v":0}]
[{"$f":"A24+1","v":14},{"$f":"'Method Comparison'!B25","v":0},{"$f":"'Method Comparison'!C25","v":0},{"$f":"C25-B25","v":0},{"$f":"POWER(D25-$D$35,2)","v":0},{"$f":"E25/19","v":0}]
[{"$f":"A25+1","v":15},{"$f":"'Method Comparison'!B26","v":0},{"$f":"'Method Comparison'!C26","v":0},{"$f":"C26-B26","v":0},{"$f":"POWER(D26-$D$35,2)","v":0},{"$f":"E26/19","v":0},null,"X Method",null,"Y Method ",null,null,"95% Conf. Limits",null,null,null,"Grade"]
[{"$f":"A26+1","v":16},{"$f":"'Method Comparison'!B27","v":0},{"$f":"'Method Comparison'!C27","v":0},{"$f":"C27-B27","v":0},{"$f":"POWER(D27-$D$35,2)","v":0},{"$f":"E27/19","v":0},null," MDP",null,"Pred. MDP",null,null,"Low",null,"High"]
[{"$f":"A27+1","v":17},{"$f":"'Method Comparison'!B28","v":0},{"$f":"'Method Comparison'!C28","v":0},{"$f":"C28-B28","v":0},{"$f":"POWER(D28-$D$35,2)","v":0},{"$f":"E28/19","v":0},{"$f":"IF(($P$9/100)*H28>$O$9,($P$9/100)*H28,$O$9)","v":0},null,null,{"$f":"IF((H28*$J$37)+$J$38>0,(H28*$J$37)+$J$38,\"-\")","v":{"$error":"#DIV/0!"}},null,null,{"$f":"IF(H28>0,(H28*($J$37-$L$37))+($J$38-$L$38),\"-\")","v":"-"},null,{"$f":"IF(H28>0,(H28*($J$37+$L$37))+($J$38+$L$38),\"-\")","v":"-"},null,{"$f":"IF(AND(ABS(M28-H28)<G28,ABS(O28-H28)<G28),\"Acceptable\",\"Unacceptable\")","v":{"$error":"#VALUE!"}}]
[{"$f":"A28+1","v":18},{"$f":"'Method Comparison'!B29","v":0},{"$f":"'Method Comparison'!C29","v":0},{"$f":"C29-B29","v":0},{"$f":"POWER(D29-$D$35,2)","v":0},{"$f":"E29/19","v":0},{"$f":"IF(($P$9/100)*H29>$O$9,($P$9/100)*H29,$O$9)","v":0},null,null,{"$f":"IF((H29*J37)+J38>0,(H29*J37)+J38,\"-\")","v":{"$error":"#DIV/0!"}},null,null,{"$f":"IF(H29>0,(H29*($J$37-$L$37))+($J$38-$L$38),\"-\")","v":"-"},null,{"$f":"IF(H29>0,(H29*($J$37+$L$37))+($J$38+$L$38),\"-\")","v":"-"},null,{"$f":"IF(AND(ABS(M29-H29)<G29,ABS(O29-H29)<G29),\"Acceptable\",\"Unacceptable\")","v":{"$error":"#VALUE!"}}]
[{"$f":"A29+1","v":19},{"$f":"'Method Comparison'!B30","v":0},{"$f":"'Method Comparison'!C30","v":0},{"$f":"C30-B30","v":0},{"$f":"POWER(D30-$D$35,2)","v":0},{"$f":"E30/19","v":0},{"$f":"IF(($P$9/100)*H30>$O$9,($P$9/100)*H30,$O$9)","v":0},null,null,{"$f":"IF((H30*J37)+J38>0,(H30*J37)+J38,\"-\")","v":{"$error":"#DIV/0!"}},null,null,{"$f":"IF(H30>0,(H30*($J$37-$L$37))+($J$38-$L$38),\"-\")","v":"-"},null,{"$f":"IF(H30>0,(H30*($J$37+$L$37))+($J$38+$L$38),\"-\")","v":"-"},null,{"$f":"IF(AND(ABS(M30-H30)<G30,ABS(O30-H30)<G30),\"Acceptable\",\"Unacceptable\")","v":{"$error":"#VALUE!"}}]
[{"$f":"A30+1","v":20},{"$f":"'Method Comparison'!B31","v":0},{"$f":"'Method Comparison'!C31","v":0},{"$f":"C31-B31","v":0},{"$f":"POWER(D31-$D$35,2)","v":0},{"$f":"E31/19","v":0},{"$f":"IF(($P$9/100)*H31>$O$9,($P$9/100)*H31,$O$9)","v":0},null,null,{"$f":"IF((H31*J37)+J38>0,(H31*J37)+J38,\"-\")","v":{"$error":"#DIV/0!"}},null,null,{"$f":"IF(H31>0,(H31*($J$37-$L$37))+($J$38-$L$38),\"-\")","v":"-"},null,{"$f":"IF(H31>0,(H31*($J$37+$L$37))+($J$38+$L$38),\"-\")","v":"-"},null,{"$f":"IF(AND(ABS(M31-H31)<G31,ABS(O31-H31)<G31),\"Acceptable\",\"Unacceptable\")","v":{"$error":"#VALUE!"}}]
["Mean",{"$f":"AVERAGE(B12:B31)","v":0},{"$f":"AVERAGE(C12:C31)","v":0},{"$f":"AVERAGE(D12:D31)","v":0},{"$f":"POWER(D32-$D$35,2)","v":0},{"$f":"SUM(F12:F31)","v":0},{"$f":"IF(($P$9/100)*H32>$O$9,($P$9/100)*H32,$O$9)","v":0},null,null,{"$f":"IF((H32*J37)+J38>0,(H32*J37)+J38,\"-\")","v":{"$error":"#DIV/0!"}},null,null,{"$f":"IF(H32>0,(H32*($J$37-$L$37))+($J$38-$L$38),\"-\")","v":"-"},null,{"$f":"IF(H32>0,(H32*($J$37+$L$37))+($J$38+$L$38),\"-\")","v":"-"},null,{"$f":"IF(AND(ABS(M32-H32)<G32,ABS(O32-H32)<G32),\"Acceptable\",\"Unacceptable\")","v":{"$error":"#VALUE!"}}]
["SD",{"$f":"STDEV(B11:B31)","v":0},{"$f":"STDEV(C12:C31)","v":0},{"$f":"STDEV(D12:D31)","v":0},null,null,{"$f":"IF(($P$9/100)*H33>$O$9,($P$9/100)*H33,$O$9)","v":0}]
["Bias",null,null,{"$f":"C32-B32","v":0},{"$f":"E32/19","v":0}]
[null,null,null,{"$f":"ABS(D34)","v":0}]
[{"$nulls":8},"Regression Statistics"]
[{"$nulls":8},"Slope",{"$f":"SLOPE(C12:C31,B12:B31)","v":{"$error":"#DIV/0!"}},"±",{"$f":"N38","v":0},null,{"$f":"LINEST(C12:C31,B12:B31,TRUE,TRUE)","v":0},0]
[null,"Interc?",{"$f":"INDEX(LINEST(C12:C31,B12:B31,1,1),1,2)","v":0},{"$nulls":5},"Intercept",{"$f":"INTERCEPT(C12:C31,B12:B31)","v":{"$error":"#DIV/0!"}},"±",{"$f":"O38","v":0},null,0,0]
[null,0,0,{"$nulls":5},"Std Err Est",{"$f":"STEYX(C12:C31,B12:B31)","v":{"$error":"#DIV/0!"}},null,null,null,1,0]
[null,{"$f":"IF(B12*($P$9/100)>$O$9,B12+(B12*($P$9/100)),B12+$O$9)","v":0},{"$f":"IF($B12*($P$9/100)>$O$9,$B12-($B12*($P$9/100)),$B12-$O$9)","v":0},{"$nulls":5},"slope err",{"$f":"INDEX(LINEST(C12:C31,B12:B31,1,1),2,1)","v":0},null,null,null,{"$error":"#NUM!"},18]
{"$rows_left_out":19}